{"text_format":"1","workbook":"xlsx","n_sheets":5,"sheets":["IDENTITAS","RANCANGAN SOAL","CONTOH","URAIAN","PRINT NASKAH SOAL"],"not_rendered":{"charts":0,"images":9,"macros":1,"external_links":1,"defined_names":5,"comments":0,"pivot_tables":0},"unopened":[],"bounds":{"document_bytes":16777216,"sheet_cells":100000,"rows_first":2000,"rows_last":500,"rows_between":2000,"halvings":0,"cell_chars":16384,"cell_head_chars":4096},"cells_cut":0,"cells_raw":0,"read":"whole","date_system":"1900"}

{"sheet":"IDENTITAS","index":0,"n_rows":22,"n_cols":4,"rows_kept":22,"cut":false,"hidden":false,"merged":[[0,0,0,2],[5,0,5,2],[1,1,1,2],[4,1,4,2],[2,1,2,6],[3,1,3,6]]}
["INPUT DATA Sekolah/GURU"]
[]
[null,"PEMERINTAH PROVINSI JAMBI"]
[null,"DINAS PENDIDIKAN"]
[]
["ULANGAN BAHASA INDONESIA SEMESTER GENAP"]
["Nama Sekolah",": ","SMAN 2 KUALA TUNGKAL"]
["Alamat Sekolah",": ","Jalan Jenderal Gatot Subroto Nomor 121 Telp. 0742 7001120 Kuala Tungkal   "]
["Kepala Sekolah",": ","EFFI RUBIYANTO, S.Pd., M.Si."]
["NIP Kepala Sekolah",": ","197007161996011000"]
["Mata Pelajaran       ",": ","BAHASA INDONESIA"]
["Kurikulum              ",": ","KTSP 2006"]
["Kelas / Semester",": ","XII IPA, IPS  / Ganjil"]
["Kelas / Komptensi ",": ","XII / Membaca, Menulis, Mendengarkan, dan Berbicara"]
["Bentuk Tes          ",": ","Pilihan Ganda,","Uraian"]
["Jumlah Soal",": ","40 PG 5 URAIAN"]
["Alokasi Waktu",": ","60 Menit"]
["Tahun Pelajaran       ",": ","2018 / 2019"]
["Penyusun           ",": ","HARLIAWAN, S.Pd."]
["NIP Penyusun",": ","197512152007011021"]
["Buku Sumber",": ","Modul dan LKS "]
["Tempat / Tanggal Pelaksanaan",": ","Kuala Tungkal, 15-11-2017"]

{"sheet":"RANCANGAN SOAL","index":1,"n_rows":77,"n_cols":18,"rows_kept":77,"cut":false,"hidden":false,"merged":[[59,11,59,15],[53,0,53,16],[56,11,56,15],[55,11,55,15],[57,11,57,15],[58,11,58,15],[71,11,71,15],[60,11,60,15],[61,11,61,15],[62,11,62,15],[63,11,63,15],[64,11,64,15],[65,11,65,15],[66,11,66,15],[67,11,67,15],[68,11,68,15],[69,11,69,15],[70,11,70,15],[72,11,72,15],[73,11,73,15],[74,11,74,15],[75,11,75,15],[76,11,76,15]]}
[1,2,3,4,5,6,7,8,9,10,11,12,13,14,15,16,17,18]
["No","KOPETENSI INTI","Kompetensi Dasar","Materi","Kelas / Semester","Indikator Soal","Level Kognitif","Bentuk Tes ","No. Soal","Kunci","Rumusan Butir Soal","Pilihan A","Pilihan B","Pilihan C","Pilihan D","Pilihan E","Pembahasan","Skor"]
[1,"2. Mengungkapkan pikiran, perasaan, dan informasi melalui kegiatan berkenalan, berdiskusi, dan bercerita","2.2 Mendiskusikan masalah (yang ditemukan dari berbagai berita,artikel, atau buku)","Makna istilah teks non sastra","X / 1","Disajikan sebuah paragraf peserta didik dapat  memaknai istilah yang terdapat dalam paragraf tersebut.\n","LK I","piihan ganda",1,"A","Bacalah kutipan teks berikut!\nSecara harfiah, luasan hutan mangrove memang hanya sekira 3% dari luas seluruh kawasan hutan dan 25% dari seluruh hutan mangrove dunia. Namun, jika dilihat dari perannya, kawasan vegetasi ini pantas diperhitungkan . oleh karena itu, Pemerintah telah mengeluarkan peraturan mengenai peruntukan hutan mangrove, yakni sebagai hutan konservasi, hutan produksi, dan hutan bagi pengunaan lain.                                                                                                                                                                                                                   Disadur dari : Arifin Arief, Hutan Mangrove : Fungsi dan Manfaatnya. Yogyakarta.    Kanisius.2007  Makna kata konservasi dalam paragraf tersebut adalah....","perlindungan","penjagaan","penataan","pengelolaan","pengawetan","Kata Konservasi dalam Kamus Besar Bahasa Indonesia adalah pemeliharaan dan perlindungan sesuatu secara teratur untuk mencegah kerusakan dan kemusnahan dengan jalan mengawetkan, pengawetan, pelestarian.","Kata Konservasi dalam Kamus Besar Bahasa Indonesia adalah pemeliharaan dan perlindungan sesuatu secara teratur untuk mencegah kerusakan dan kemusnahan dengan jalan mengawetkan, pengawetan, pelestarian."]
[2,"Memahami informasi dari berbagai laporan","1.1 Membedakan antara fakta dan opini dari berbagai laporan lisan","Laporan kegiatan ",null,"Membedakan kalimat yang berupa fakta dan yang berupa opini (pendapat)","LK III","piihan ganda",2,"E",null,"(1) dan (2)","(1) dan (3)","(3) dan (4)","(3) dan (5)","(4) dan (5)","(4) dan (5)","(4) dan (5)"]
[3,"Memahami informasi dari berbagai laporan","1.2 Mengomentari berbagai laporan lisan Dengan Memberikan kritik dan saran","Laporan kegiatan ekstrakurikuler ",null,"Memberikan saran untuk perbaikan laporan","LK III","piihan ganda",3,"B","Cermati kutipan proposal berikut! \n        Seni merupakan kreativitas unik yang patut kita kembangkan agar semakin besar. Merupakan salah satu cara mengembangkannya adalah Pentas Seni dan bakat Osis SMA Jakarta akan mengadakan pementasan drama bagi seluruh siswa.\n \nPerbaikan yang tepat  kalimat yang bercetak tebal pada kutipan tersebut adalah ...\n","(1) dan (2)","(1), (2), dan (3)","(2) dan (4)","(2), (3), dan (4)","(4) dan (5)","(4) dan (5)","(4) dan (5)"]
[4,"Mengungkapkan gagasan, tanggapan, dan informasi","2.1 Menyampaikan gagasan dan tanggapan dengan alasan yang logis","Ungkapan persetujuan atau penolakan",null,"Mengemukakan persetujuan atau penolakan dengan alasan yang logis","LK II","piihan ganda",4,"C",null,"Mengecam kinerja POLRI yang kurang baik.","Memberitahukan kepada rakyat agar menggunakan SMS, surat, maupun telepon dalam berkomunikasi dengan presiden.","Mengimbau agar POLRI meningkatkan kualitas pelayanan kepada masyarakat dengan penuh tanggung jawab.","Menenangkan hati rakyat dengan cara mengadakan komunikasi melalui surat, telepon, maupun SMS.","Mendorong masyarakat agar membantu POLRI dalam meningkatkan kualitas pelayanan.","Mendorong masyarakat agar membantu POLRI dalam meningkatkan kualitas pelayanan.","Mendorong masyarakat agar membantu POLRI dalam meningkatkan kualitas pelayanan."]
[5,"Mengungkapkan gagasan, tanggapan, dan informasi","2.2 Menyampaikan intisari buku nonfiksi dengan menggunakan bahasa yang efektif\n","Intisari buku",null,"Mencatat hal-hal yang menarik atau yang mengagumkan dalam isi buku nonfiksi","LK I","piihan ganda",5,"B",null,"Pendidikan sangat diperlukan setiap individu dalam kehidupan bermasyarakat, terutama dalam menjadikan masyarakat berbudaya.","Pendidikan adalah proses berkesinambungan dalam memanusiakan manusia menjadi manusia utuh dan berbudaya sesuai potensi yang dimiliki.","Selama masih hidup, setiap individu memerlukan pendidikan dengan tujuan untuk memanusiakan dirinya agar menjadi manusia yang utuh dan menjadikan dirinya berbudaya.","Pendidikan dan kehidupan ini tidak dapat dipisahkan karena pendidikan diperlukan oleh setiap individu untuk mencapai taraf insani, yakni sebagai manusia yang utuh dan membudayakan diri.","Melalui pendidikan, manusia dapat mencapai taraf hidup yang lebih baik, yakni sebagai manusia yang utuh dan membudayakan diri.","Melalui pendidikan, manusia dapat mencapai taraf hidup yang lebih baik, yakni sebagai manusia yang utuh dan membudayakan diri.","Melalui pendidikan, manusia dapat mencapai taraf hidup yang lebih baik, yakni sebagai manusia yang utuh dan membudayakan diri."]
[6,null,null,null,null,null,null,null,6]
[7,null,null,null,null,null,null,null,7]
[8,null,null,null,null,null,null,null,8,"D"]
[9,null,null,null,null,null,null,null,9]
[10,null,null,null,null,null,null,null,10]
[11,null,null,null,null,null,null,null,11]
[12,null,null,null,null,null,null,null,12]
[13,null,null,null,null,null,null,null,13]
[14,null,null,null,null,null,null,null,14]
[15,null,null,null,null,null,null,null,15]
[16,null,null,null,null,null,null,null,16]
[17,null,null,null,null,null,null,null,17]
[18,null,null,null,null,null,null,null,18]
[19,null,null,null,null,null,null,null,19]
[20,null,null,null,null,null,null,null,20]
[21,null,null,null,null,null,null,null,21]
[22,null,null,null,null,null,null,null,22]
[23,null,null,null,null,null,null,null,23]
[24,null,null,null,null,null,null,null,24]
[25,null,null,null,null,null,null,null,25]
[26,null,null,null,null,null,null,null,26]
[27,null,null,null,null,null,null,null,27]
[28,null,null,null,null,null,null,null,28]
{"$rows_left_out":48}
{"sheet":"CONTOH","index":2,"n_rows":25,"n_cols":26,"rows_kept":25,"cut":false,"hidden":false,"merged":[[8,1,11,4],[11,6,11,7],[11,9,11,22],[0,1,0,23],[1,25,2,25],[3,13,3,17],[7,1,7,4],[7,5,7,8],[12,1,12,4],[12,6,12,7],[12,10,16,22],[13,1,14,4],[15,1,15,4],[16,1,18,4],[17,6,17,7],[17,9,17,22],[18,6,18,7],[18,10,18,22],[19,1,19,4],[19,10,19,22],[20,1,26,4],[20,10,20,22],[21,10,21,22],[22,10,22,22],[23,6,23,22],[24,6,26,22]]}
[null,"KARTU SOAL BENTUK PILIHAN GANDA"]
[null,null,null,null,null,null,null,null,null,null,null,null,null,null,null,null,null,null,null,null,null,null,null,null,null,1]
[null,"Nama Sekolah",null,": ",{"$f":"IDENTITAS!$C$7","v":"SMAN 2 KUALA TUNGKAL"},null,null,null,null,null,null,null,null,"Bentuk Tes          ",null,null,null,null,": ",{"$f":"IDENTITAS!$C$15","v":"Pilihan Ganda,"}]
[null,"Mata Pelajaran       ",null,": ",{"$f":"IDENTITAS!$C$11","v":"BAHASA INDONESIA"},null,null,null,null,null,null,null,null,"Jumlah Soal",null,null,null,null,": ",{"$f":"IDENTITAS!$C$16","v":"40 PG 5 URAIAN"}]
[null,"Kurikulum              ",null,": ",{"$f":"IDENTITAS!$C$12","v":"KTSP 2006"},null,null,null,null,null,null,null,null,"Tahun Ajaran       ",null,null,null,null,":",{"$f":"IDENTITAS!$C$18","v":"2018 / 2019"}]
[null,"Kelas / Semester",null,": ",{"$f":"IDENTITAS!$C$13","v":"XII IPA, IPS  / Ganjil"},null,null,null,null,null,null,null,null,"Penyusun           ",null,null,null,null,": ",{"$f":"IDENTITAS!$C$19","v":"HARLIAWAN, S.Pd."}]
[]
[null,"Standar Kompetensi",null,null,null,"Buku Sumber  :",null,null,null,null,null,null,"Kelas/Semester",null,null,null,null,null,{"$f":"IFERROR(IF(INDEX('RANCANGAN SOAL'!$G$3:$G$1000,MATCH(G13,'RANCANGAN SOAL'!$A$3:$A$1000,0),0)=\"LK I\",\"X\",\"\"),\"\")","v":"X"},null,{"$f":"IF(LEN(S8),\"\",IFERROR(IF(INDEX('RANCANGAN SOAL'!$G$3:$G$1000,MATCH(G13,'RANCANGAN SOAL'!$A$3:$A$1000,0),0)=\"LK II\",\"X\",\"\"),\"\"))","v":""},null,{"$f":"IF(LEN(S8)+LEN(U8),\"\",IFERROR(IF(INDEX('RANCANGAN SOAL'!$G$3:$G$1000,MATCH(G13,'RANCANGAN SOAL'!$A$3:$A$1000,0),0)=\"LK III\",\"X\",\"\"),\"\"))","v":""}]
[null,{"$f":"INDEX(tbSoal.PG[],MATCH($G13,tbSoal.PG[No. Soal],0),2)","v":"2. Mengungkapkan pikiran, perasaan, dan informasi melalui kegiatan berkenalan, berdiskusi, dan bercerita"},null,null,null,null,{"$f":"IDENTITAS!C21","v":"Modul dan LKS "},null,null,null,null,null,{"$f":"INDEX(tbSoal.PG[],MATCH($G13,tbSoal.PG[No. Soal],0),5)","v":"X / 1"},null,null,null,null,null,"Pengetahuan/",null,"Aplikasi",null,"Penalaran"]
[null,null,null,null,null,null,null,null,null,null,null,null,null,null,null,null,null,null,"Pemahaman"]
[]
[null,null,null,null,null,null,"No.Soal",null,null,"Rumusan Butir Soal"]
[null,"Kompetensi Dasar",null,null,null,null,{"$f":"Z2","v":1},null,null,{"$f":"G13","v":1}]
[null,{"$f":"INDEX(tbSoal.PG[],MATCH($G13,tbSoal.PG[No. Soal],0),3)","v":"2.2 Mendiskusikan masalah (yang ditemukan dari berbagai berita,artikel, atau buku)"}]
[]
[null,"Materi"]
[null,{"$f":"INDEX(tbSoal.PG[],MATCH($G13,tbSoal.PG[No. Soal],0),4)","v":"Makna istilah teks non sastra"}]
[null,null,null,null,null,null,"Kunci",null,null,"Pilihan Jawaban"]
[null,null,null,null,null,null,{"$f":"INDEX(tbSoal.PG[],MATCH($G13,tbSoal.PG[No. Soal],0),10)","v":"A"},null,null,"a.",{"$f":"INDEX(tbSoal.PG[],MATCH($G13,tbSoal.PG[No. Soal],0),12)","v":"perlindungan"}]
[null,"Indikator Soal",null,null,null,null,null,null,null,"b.",{"$f":"INDEX(tbSoal.PG[],MATCH($G13,tbSoal.PG[No. Soal],0),13)","v":"penjagaan"}]
[null,{"$f":"INDEX(tbSoal.PG[],MATCH($G13,tbSoal.PG[No. Soal],0),6)","v":"Disajikan sebuah paragraf peserta didik dapat  memaknai istilah yang terdapat dalam paragraf tersebut.\n"},null,null,null,null,null,null,null,"c.",{"$f":"INDEX(tbSoal.PG[],MATCH($G13,tbSoal.PG[No. Soal],0),14)","v":"penataan"}]
[null,null,null,null,null,null,null,null,null,"d.",{"$f":"INDEX(tbSoal.PG[],MATCH($G13,tbSoal.PG[No. Soal],0),15)","v":"pengelolaan"}]
[null,null,null,null,null,null,null,null,null,"e.",{"$f":"INDEX(tbSoal.PG[],MATCH($G13,tbSoal.PG[No. Soal],0),16)","v":"pengawetan"}]
[null,null,null,null,null,null,"Pembahasan"]
[null,null,null,null,null,null,{"$f":"INDEX(tbSoal.PG[],MATCH($G13,tbSoal.PG[No. Soal],0),17)","v":"Kata Konservasi dalam Kamus Besar Bahasa Indonesia adalah pemeliharaan dan perlindungan sesuatu secara teratur untuk mencegah kerusakan dan kemusnahan dengan jalan mengawetkan, pengawetan, pelestarian."}]

{"sheet":"URAIAN","index":3,"n_rows":21,"n_cols":26,"rows_kept":21,"cut":false,"hidden":false,"merged":[[1,25,2,25],[0,1,0,23],[3,13,3,17],[7,1,7,4],[7,5,7,8],[5,25,6,25],[20,1,26,4],[18,6,26,22],[8,1,11,4],[11,6,11,7],[11,9,11,22],[19,1,19,4],[12,1,12,4],[12,6,12,7],[12,10,16,22],[13,1,14,4],[15,1,15,4],[16,1,18,4],[17,6,17,22]]}
[null,"KARTU SOAL BENTUK PILIHAN GANDA"]
[null,null,null,null,null,null,null,null,null,null,null,null,null,null,null,null,null,null,null,null,null,null,null,null,null,1]
[null,"Nama Sekolah",null,": ",{"$f":"IDENTITAS!$C$7","v":"SMAN 2 KUALA TUNGKAL"},null,null,null,null,null,null,null,null,"Bentuk Tes          ",null,null,null,null,": ",{"$f":"IDENTITAS!$C$15","v":"Pilihan Ganda,"}]
[null,"Mata Pelajaran       ",null,": ",{"$f":"IDENTITAS!$C$11","v":"BAHASA INDONESIA"},null,null,null,null,null,null,null,null,"Jumlah Soal",null,null,null,null,": ",{"$f":"IDENTITAS!$C$16","v":"40 PG 5 URAIAN"}]
[null,"Kurikulum              ",null,": ",{"$f":"IDENTITAS!$C$12","v":"KTSP 2006"},null,null,null,null,null,null,null,null,"Tahun Ajaran       ",null,null,null,null,":",{"$f":"IDENTITAS!$C$18","v":"2018 / 2019"}]
[null,"Kelas / Semester",null,": ",{"$f":"IDENTITAS!$C$13","v":"XII IPA, IPS  / Ganjil"},null,null,null,null,null,null,null,null,"Penyusun           ",null,null,null,null,": ",{"$f":"IDENTITAS!$C$19","v":"HARLIAWAN, S.Pd."},null,null,null,null,null,6]
[]
[null,"Standar Kompetensi",null,null,null,"Buku Sumber  :",null,null,null,null,null,null,"Kelas/Semester",null,null,null,null,null,{"$f":"IFERROR(IF(INDEX('RANCANGAN SOAL'!$G$3:$G$1000,MATCH(G13,'RANCANGAN SOAL'!$A$3:$A$1000,0),0)=\"LK I\",\"X\",\"\"),\"\")","v":"X"},null,{"$f":"IF(LEN(S8),\"\",IFERROR(IF(INDEX('RANCANGAN SOAL'!$G$3:$G$1000,MATCH(G13,'RANCANGAN SOAL'!$A$3:$A$1000,0),0)=\"LK II\",\"X\",\"\"),\"\"))","v":""},null,{"$f":"IF(LEN(S8)+LEN(U8),\"\",IFERROR(IF(INDEX('RANCANGAN SOAL'!$G$3:$G$1000,MATCH(G13,'RANCANGAN SOAL'!$A$3:$A$1000,0),0)=\"LK III\",\"X\",\"\"),\"\"))","v":""}]
[null,{"$f":"INDEX(tbSoal.PG[],MATCH($G13,tbSoal.PG[No. Soal],0),2)","v":"2. Mengungkapkan pikiran, perasaan, dan informasi melalui kegiatan berkenalan, berdiskusi, dan bercerita"},null,null,null,null,{"$f":"IDENTITAS!C21","v":"Modul dan LKS "},null,null,null,null,null,{"$f":"INDEX(tbSoal.PG[],MATCH($G13,tbSoal.PG[No. Soal],0),5)","v":"X / 1"},null,null,null,null,null,"Pengetahuan/",null,"Aplikasi",null,"Penalaran"]
[null,null,null,null,null,null,null,null,null,null,null,null,null,null,null,null,null,null,"Pemahaman"]
[]
[null,null,null,null,null,null,"No.Soal",null,null,"Rumusan Butir Soal"]
[null,"Kompetensi Dasar",null,null,null,null,{"$f":"Z2","v":1},null,null,{"$f":"G13","v":1}]
[null,{"$f":"INDEX(tbSoal.PG[],MATCH($G13,tbSoal.PG[No. Soal],0),3)","v":"2.2 Mendiskusikan masalah (yang ditemukan dari berbagai berita,artikel, atau buku)"}]
[]
[null,"Materi"]
[null,{"$f":"INDEX(tbSoal.PG[],MATCH($G13,tbSoal.PG[No. Soal],0),4)","v":"Makna istilah teks non sastra"}]
[null,null,null,null,null,null,"Uraian Jawaban"]
[null,null,null,null,null,null,{"$f":"indek","v":{"$error":"#NAME?"}}]
[null,"Indikator Soal"]
[null,{"$f":"INDEX(tbSoal.PG[],MATCH($G13,tbSoal.PG[No. Soal],0),6)","v":"Disajikan sebuah paragraf peserta didik dapat  memaknai istilah yang terdapat dalam paragraf tersebut.\n"}]

{"sheet":"PRINT NASKAH SOAL","index":4,"n_rows":332,"n_cols":10,"rows_kept":332,"cut":false,"hidden":false,"merged":[[267,1,267,11],[273,1,273,11],[279,1,279,11],[285,1,285,11],[291,1,291,11],[297,1,297,11],[303,1,303,11],[15,1,15,11],[27,1,27,11],[33,1,33,11],[39,1,39,11],[213,1,213,11],[219,1,219,11],[225,1,225,11],[231,1,231,11],[237,1,237,11],[243,1,243,11],[249,1,249,11],[255,1,255,11],[261,1,261,11],[212,2,212,11],[211,2,211,11],[210,2,210,11],[87,1,87,11],[94,2,94,11],[9,1,9,11],[21,1,21,11],[45,1,45,11],[51,1,51,11],[57,1,57,11],[63,1,63,11],[69,1,69,11],[75,1,75,11],[81,1,81,11],[24,2,24,11],[23,2,23,11],[22,2,22,11],[76,2,76,11],[74,2,74,11],[73,2,73,11],[72,2,72,11],[71,2,71,11],[70,2,70,11],[105,1,105,11],[111,1,111,11],[117,1,117,11],[123,1,123,11],[129,1,129,11],[135,1,135,11],[141,1,141,11],[96,2,96,11],[95,2,95,11],[159,0,164,0],[165,0,170,0],[171,0,176,0],[177,0,182,0],[209,2,209,11],[208,2,208,11],[206,2,206,11],[205,2,205,11],[204,2,204,11],[203,2,203,11],[225,0,230,0],[231,0,236,0],[237,0,242,0],[243,0,248,0],[249,0,254,0],[183,0,188,0],[189,0,194,0],[195,0,200,0],[201,0,206,0],[207,0,212,0],[213,0,218,0],[219,0,224,0],[291,0,296,0],[297,0,302,0],[303,0,308,0],[255,0,260,0],[261,0,266,0],[267,0,272,0],[273,0,278,0],[279,0,284,0],[285,0,290,0],[111,0,116,0],[117,0,122,0],[123,0,128,0],[129,0,134,0],[135,0,140,0],[141,0,146,0],[147,0,152,0],[93,0,98,0],[99,0,104,0],[105,0,110,0],[45,0,50,0],[51,0,56,0],[57,0,62,0],[63,0,68,0],[69,0,74,0],[153,0,158,0],[66,2,66,11],[65,2,65,11],[27,0,32,0],[33,0,38,0],[39,0,44,0],[110,2,110,11],[109,2,109,11],[108,2,108,11],[128,2,128,11],[127,2,127,11],[126,2,126,11],[125,2,125,11],[124,2,124,11],[122,2,122,11],[121,2,121,11],[120,2,120,11],[119,2,119,11],[77,2,77,11],[15,0,20,0],[75,0,80,0],[81,0,86,0],[87,0,92,0],[170,2,170,11],[169,2,169,11],[168,2,168,11],[167,2,167,11],[166,2,166,11],[68,2,68,11],[67,2,67,11],[17,2,17,11],[18,2,18,11],[64,2,64,11],[62,2,62,11],[61,2,61,11],[60,2,60,11],[59,2,59,11],[58,2,58,11],[56,2,56,11],[19,2,19,11],[20,2,20,11],[26,2,26,11],[25,2,25,11],[202,2,202,11],[159,1,159,11],[165,1,165,11],[171,1,171,11],[177,1,177,11],[183,1,183,11],[189,1,189,11],[195,1,195,11],[201,1,201,11],[188,2,188,11],[187,2,187,11],[186,2,186,11],[185,2,185,11],[184,2,184,11],[182,2,182,11],[181,2,181,11],[180,2,180,11],[179,2,179,11],[178,2,178,11],[176,2,176,11],[175,2,175,11],[174,2,174,11],[173,2,173,11],[172,2,172,11],[207,1,207,11],[0,2,0,11],[1,2,1,11],[2,2,2,11],[31,2,31,11],[30,2,30,11],[29,2,29,11],[28,2,28,11],[37,2,37,11],[36,2,36,11],[35,2,35,11],[34,2,34,11],[32,2,32,11],[3,2,3,11],[5,0,5,11],[10,2,10,11],[11,2,11,11],[12,2,12,11],[13,2,13,11],[14,2,14,11],[8,0,8,7],[9,0,14,0],[4,2,4,9],[16,2,16,11],[118,2,118,11],[116,2,116,11],[115,2,115,11],[114,2,114,11],[113,2,113,11],[112,2,112,11],[151,2,151,11],[150,2,150,11],[21,0,26,0],[55,2,55,11],[54,2,54,11],[53,2,53,11],[52,2,52,11],[50,2,50,11],[49,2,49,11],[48,2,48,11],[47,2,47,11],[46,2,46,11],[44,2,44,11],[43,2,43,11],[42,2,42,11],[41,2,41,11],[40,2,40,11],[38,2,38,11],[84,2,84,11],[83,2,83,11],[82,2,82,11],[80,2,80,11],[79,2,79,11],[78,2,78,11],[107,2,107,11],[106,2,106,11],[104,2,104,11],[103,2,103,11],[102,2,102,11],[101,2,101,11],[100,2,100,11],[98,2,98,11],[97,2,97,11],[92,2,92,11],[91,2,91,11],[90,2,90,11],[89,2,89,11],[88,2,88,11],[86,2,86,11],[85,2,85,11],[93,1,93,11],[99,1,99,11],[163,2,163,11],[137,2,137,11],[136,2,136,11],[134,2,134,11],[133,2,133,11],[132,2,132,11],[131,2,131,11],[130,2,130,11],[138,2,138,11],[148,2,148,11],[146,2,146,11],[145,2,145,11],[144,2,144,11],[143,2,143,11],[142,2,142,11],[140,2,140,11],[139,2,139,11],[162,2,162,11],[161,2,161,11],[147,1,147,11],[153,1,153,11],[236,2,236,11],[235,2,235,11],[234,2,234,11],[233,2,233,11],[232,2,232,11],[230,2,230,11],[229,2,229,11],[228,2,228,11],[227,2,227,11],[226,2,226,11],[224,2,224,11],[223,2,223,11],[222,2,222,11],[221,2,221,11],[220,2,220,11],[200,2,200,11],[149,2,149,11],[198,2,198,11],[197,2,197,11],[196,2,196,11],[194,2,194,11],[193,2,193,11],[192,2,192,11],[191,2,191,11],[190,2,190,11],[160,2,160,11],[158,2,158,11],[157,2,157,11],[156,2,156,11],[155,2,155,11],[154,2,154,11],[152,2,152,11],[164,2,164,11],[308,2,308,11],[307,2,307,11],[306,2,306,11],[305,2,305,11],[304,2,304,11],[302,2,302,11],[301,2,301,11],[300,2,300,11],[199,2,199,11],[248,2,248,11],[247,2,247,11],[246,2,246,11],[245,2,245,11],[244,2,244,11],[242,2,242,11],[241,2,241,11],[240,2,240,11],[239,2,239,11],[238,2,238,11],[218,2,218,11],[217,2,217,11],[216,2,216,11],[215,2,215,11],[214,2,214,11],[299,2,299,11],[298,2,298,11],[296,2,296,11],[295,2,295,11],[294,2,294,11],[293,2,293,11],[292,2,292,11],[290,2,290,11],[289,2,289,11],[288,2,288,11],[287,2,287,11],[286,2,286,11],[284,2,284,11],[283,2,283,11],[282,2,282,11],[281,2,281,11],[280,2,280,11],[278,2,278,11],[277,2,277,11],[276,2,276,11],[275,2,275,11],[274,2,274,11],[272,2,272,11],[271,2,271,11],[270,2,270,11],[269,2,269,11],[268,2,268,11],[266,2,266,11],[265,2,265,11],[264,2,264,11],[263,2,263,11],[262,2,262,11],[251,2,251,11],[250,2,250,11],[260,2,260,11],[259,2,259,11],[258,2,258,11],[257,2,257,11],[256,2,256,11],[254,2,254,11],[253,2,253,11],[252,2,252,11],[312,1,312,11],[313,1,313,11],[314,1,314,11],[315,1,315,11],[316,1,316,11],[317,1,317,11],[318,1,318,11],[319,1,319,11],[320,1,320,11],[330,1,330,11],[331,1,331,11],[321,1,321,11],[322,1,322,11],[323,1,323,11],[324,1,324,11],[325,1,325,11],[326,1,326,11],[327,1,327,11],[328,1,328,11],[329,1,329,11]]}
[null,null,{"$f":"IDENTITAS!B3","v":"PEMERINTAH PROVINSI JAMBI"}]
[null,null,{"$f":"IDENTITAS!B4","v":"DINAS PENDIDIKAN"}]
[null,null,{"$f":"IDENTITAS!C7","v":"SMAN 2 KUALA TUNGKAL"}]
[null,null,{"$f":"IDENTITAS!C8","v":"Jalan Jenderal Gatot Subroto Nomor 121 Telp. 0742 7001120 Kuala Tungkal   "}]
[]
[{"$f":"[1]IDENTITAS!$A$6","v":"ULANGAN BAHASA INDONESIA SEMESTER GANJIL"}]
[{"$f":"IDENTITAS!$A$11","v":"Mata Pelajaran       "},null,null,":",{"$f":"IDENTITAS!C11","v":"BAHASA INDONESIA"},null,{"$f":"IDENTITAS!A13","v":"Kelas / Semester"},null,":",{"$f":"IDENTITAS!C13","v":"XII IPA, IPS  / Ganjil"}]
[{"$f":"IDENTITAS!A17","v":"Alokasi Waktu"},null,null,":",{"$f":"IDENTITAS!C17","v":"60 Menit"},null,{"$f":"IDENTITAS!A22","v":"Tempat / Tanggal Pelaksanaan"},null,":",{"$f":"IDENTITAS!C22","v":"Kuala Tungkal, 15-11-2017"}]
[]
[{"$f":"'RANCANGAN SOAL'!A3","v":1}]
[null,"a.",{"$f":"INDEX(tbSoal.PG[],MATCH($A10,tbSoal.PG[No. Soal],0),12)","v":"perlindungan"}]
[null,"b.",{"$f":"INDEX(tbSoal.PG[],MATCH($A10,tbSoal.PG[No. Soal],0),13)","v":"penjagaan"}]
[null,"c.",{"$f":"INDEX(tbSoal.PG[],MATCH($A10,tbSoal.PG[No. Soal],0),14)","v":"penataan"}]
[null,"d.",{"$f":"INDEX(tbSoal.PG[],MATCH($A10,tbSoal.PG[No. Soal],0),15)","v":"pengelolaan"}]
[null,"e.",{"$f":"INDEX(tbSoal.PG[],MATCH($A10,tbSoal.PG[No. Soal],0),16)","v":"pengawetan"}]
[{"$f":"A10+1","v":2}]
[null,"a.",{"$f":"INDEX(tbSoal.PG[],MATCH($A16,tbSoal.PG[No. Soal],0),12)","v":"(1) dan (2)"}]
[null,"b.",{"$f":"INDEX(tbSoal.PG[],MATCH($A16,tbSoal.PG[No. Soal],0),13)","v":"(1) dan (3)"}]
[null,"c.",{"$f":"INDEX(tbSoal.PG[],MATCH($A16,tbSoal.PG[No. Soal],0),14)","v":"(3) dan (4)"}]
[null,"d.",{"$f":"INDEX(tbSoal.PG[],MATCH($A16,tbSoal.PG[No. Soal],0),15)","v":"(3) dan (5)"}]
[null,"e.",{"$f":"INDEX(tbSoal.PG[],MATCH($A16,tbSoal.PG[No. Soal],0),16)","v":"(4) dan (5)"}]
[{"$f":"A16+1","v":3}]
[null,"a.",{"$f":"INDEX(tbSoal.PG[],MATCH($A22,tbSoal.PG[No. Soal],0),12)","v":"(1) dan (2)"}]
[null,"b.",{"$f":"INDEX(tbSoal.PG[],MATCH($A22,tbSoal.PG[No. Soal],0),13)","v":"(1), (2), dan (3)"}]
[null,"c.",{"$f":"INDEX(tbSoal.PG[],MATCH($A22,tbSoal.PG[No. Soal],0),14)","v":"(2) dan (4)"}]
[null,"d.",{"$f":"INDEX(tbSoal.PG[],MATCH($A22,tbSoal.PG[No. Soal],0),15)","v":"(2), (3), dan (4)"}]
[null,"e.",{"$f":"INDEX(tbSoal.PG[],MATCH($A22,tbSoal.PG[No. Soal],0),16)","v":"(4) dan (5)"}]
[{"$f":"A22+1","v":4}]
[null,"a.",{"$f":"INDEX(tbSoal.PG[],MATCH($A28,tbSoal.PG[No. Soal],0),12)","v":"Mengecam kinerja POLRI yang kurang baik."}]
[null,"b.",{"$f":"INDEX(tbSoal.PG[],MATCH($A28,tbSoal.PG[No. Soal],0),13)","v":"Memberitahukan kepada rakyat agar menggunakan SMS, surat, maupun telepon dalam berkomunikasi dengan presiden."}]
{"$rows_left_out":302}